Target
Gag-Pol polyprotein [489-587]
Ligand
BDBM50004788
Substrate
Meas. Tech.
ChEBML_79800
IC50
2250±n/a nM
Citation
 DeCamp, DLBabé, LMSalto, RLucich, JLKoo, MSKahl, SBCraik, CS Specific inhibition of HIV-1 protease by boronated porphyrins. J Med Chem 35:3426-8 (1992)  
Target
Name:
Gag-Pol polyprotein [489-587]
Synonyms:
Human immunodeficiency virus type 1 protease Pol polyprotein | gag-pol
Type:
Enzyme Subunit
Mol. Mass.:
10781.16
Organism:
Human immunodeficiency virus type 1
Description:
P04585[489-587]
Residue:
99
  
Inhibitor
Name:
BDBM50004788
Synonyms:
3-[18-(2-Carboxy-ethyl)-8,13-bis-(1,2-diacetoxy-ethyl)-3,7,12,17-tetramethyl-22,24-dihydro-porphin-2-yl]-propionic acid;Co complex | CHEMBL430519
Type:
Small organic molecule
Emp. Form.:
C50H44CoN4O12
Mol. Mass.:
951.8372
SMILES:
CC1=C(CCC(O)=O)\C2=C\c3c(CCC(O)=O)c(C)c4\C=C5/N=C(/C=c6/c(C(COC(=O)C7=CC7)OC(=O)C7=CC7)c(C)\c(=C\C1=N2)n6[Co]n34)C(C)=C5C(COC(=O)C1=CC1)OC(=O)C1=CC1
: