Target
Neuropeptide Y receptor type 1
Ligand
BDBM50003055
Substrate
Meas. Tech.
ChEBML_143821
Kd
>1000±n/a nM
Citation
 Reymond, MTDelmas, LKoerber, SCBrown, MRRivier, JE Truncated, branched, and/or cyclic analogues of neuropeptide Y: importance of the pancreatic peptide fold in the design of specific Y2 receptor ligands. J Med Chem 35:3653-9 (1992)  
Target
Name:
Neuropeptide Y receptor type 1
Synonyms:
NPY-Y1 NPY1R NPYR neuropeptide Y receptor Y1
Type:
Enzyme Catalytic Domain
Mol. Mass.:
44399.07
Organism:
Homo sapiens (Human)
Description:
NPY-Y1 NPY1R HUMAN::P25929
Residue:
384
  
Inhibitor
Name:
BDBM50003055
Synonyms:
CHEMBL414947 | Tyr-Pro-Ser-Lys-Pro-Ala-Leu-Arg-His-Tyr-Ile-Asn-Leu-Ile-Thr-Arg-Gln-Arg-Tyr
Type:
Small organic molecule
Emp. Form.:
C110H174N34O26
Mol. Mass.:
2388.7708
SMILES:
CCC[C@H](NC(=O)[C@H](C)NC(=O)[C@@H]1CCCN1C(=O)[C@H](CCCCN)NC(=O)[C@H](CO)NC(=O)[C@@H]1CCCN1C(=O)[C@@H](N)Cc1ccc(O)cc1)C(=O)N(C)[C@@H](CCCNC(N)=N)C(=O)N[C@@H](Cc1cnc[nH]1)C(=O)N[C@@H](Cc1ccc(O)cc1)C(=O)N[C@@H]([C@@H](C)CC)C(=O)N[C@@H](CC(N)=O)C(=O)N[C@@H](CC(C)C)C(=O)N[C@@H]([C@@H](C)CC)C(=O)N[C@@H]([C@@H](C)O)C(=O)N[C@@H](CCCNC(N)=N)C(=O)N[C@@H](CCC(N)=O)C(=O)N[C@@H](CCCNC(N)=N)C(=O)N[C@@H](Cc1ccc(O)cc1)C(N)=O
: