Target
Renin
Ligand
BDBM50003187
Substrate
Meas. Tech.
ChEBML_195749
pH
7.4±n/a
IC50
590±n/a nM
Comments
extracted
Citation
 Weber, AESteiner, MGKrieter, PAColletti, AETata, JRHalgren, TABall, RGDoyle, JJSchorn, TWStearns, RA Highly potent, orally active diester macrocyclic human renin inhibitors. J Med Chem 35:3755-73 (1992)  
Target
Name:
Renin
Synonyms:
Angiotensinogenase RENI_HUMAN
Type:
Enzyme
Mol. Mass.:
45058.99
Organism:
Homo sapiens (Human)
Description:
Residue:
406
  
Inhibitor
Name:
BDBM50003187
Synonyms:
CHEMBL92538 | [1-(4-Cyclohexylmethyl-3-hydroxy-2,6,10-trioxo-1-oxa-5,9-diaza-cyclotetradec-7-ylcarbamoyl)-2-phenyl-ethyl]-carbamic acid tert-butyl ester
Type:
Small organic molecule
Emp. Form.:
C32H48N4O8
Mol. Mass.:
616.7455
SMILES:
CC(C)(C)OC(=O)N[C@@H](Cc1ccccc1)C(=O)N[C@H]1CNC(=O)CCCCOC(=O)[C@H](O)[C@H](CC2CCCCC2)NC1=O
: