Target
Gag-Pol polyprotein [489-587]
Ligand
BDBM50368409
Substrate
Meas. Tech.
ChEBML_157563
Ki
0.500000±n/a nM
Citation
 Rich, DHPrasad, JVSun, CQGreen, JMueller, RHouseman, KMacKenzie, DMalkovsky, M New hydroxyethylamine HIV protease inhibitors that suppress viral replication. J Med Chem 35:3803-12 (1992)  
Target
Name:
Gag-Pol polyprotein [489-587]
Synonyms:
Human immunodeficiency virus type 1 protease Pol polyprotein | gag-pol
Type:
Enzyme Subunit
Mol. Mass.:
10781.16
Organism:
Human immunodeficiency virus type 1
Description:
P04585[489-587]
Residue:
99
  
Inhibitor
Name:
BDBM50368409
Synonyms:
CHEMBL1790877 | CHEMBL3349488
Type:
Small organic molecule
Emp. Form.:
C49H57N7O8
Mol. Mass.:
872.019
SMILES:
[H][C@@](O)(CN1CCCC1C(=O)N[C@@H]([C@@H](C)CC)C(=O)N[C@@H](Cc1ccc2ccccc2c1)C(=O)OC)[C@H](Cc1ccccc1)NC(=O)[C@H](CC(N)=O)NC(=O)c1ccc2ccccc2n1
: