Target
Cysteinyl leukotriene receptor 1
Ligand
BDBM50001289
Substrate
Meas. Tech.
ChEBML_52046
IC50
89±n/a nM
Citation
 Zamboni, RBelley, MChampion, ECharette, LDeHaven, RFrenette, RGauthier, JYJones, TRLeger, SMasson, P Development of a novel series of styrylquinoline compounds as high-affinity leukotriene D4 receptor antagonists: synthetic and structure-activity studies leading to the discovery of (+-)-3-[[[3-[2-(7-chloro-2-quinolinyl)-(E)-ethenyl]phenyl][[3- (dimethylamino)-3-oxopropyl]thio]methyl]thio]propionic J Med Chem 35:3832-44 (1992)  
Target
Name:
Cysteinyl leukotriene receptor 1
Synonyms:
CLTR1_CAVPO | CYSLTR1
Type:
Enzyme Catalytic Domain
Mol. Mass.:
39007.58
Organism:
GUINEA PIG
Description:
Leukotriene D4 0 GUINEA PIG::Q2NNR5
Residue:
340
  
Inhibitor
Name:
BDBM50001289
Synonyms:
3-{(2-Dimethylcarbamoyl-ethylsulfanyl)-[3-(quinolin-2-ylmethylsulfanyl)-phenyl]-methylsulfanyl}-propionic acid | CHEMBL123958
Type:
Small organic molecule
Emp. Form.:
C25H28N2O3S3
Mol. Mass.:
500.696
SMILES:
CN(C)C(=O)CCSC(SCCC(O)=O)c1cccc(SCc2ccc3ccccc3n2)c1
: