Target
Alpha-2A adrenergic receptor
Ligand
BDBM50002147
Substrate
Meas. Tech.
ChEBML_33032
Ki
480±n/a nM
Citation
 Meurer, LCTolman, RLChapin, EWSaperstein, RVicario, PPZrada, MMMacCoss, M Synthesis and hypoglycemic activity of substituted 8-(1-piperazinyl)imidazo[1,2-a]pyrazines. J Med Chem 35:3845-57 (1992)  
Target
Name:
Alpha-2A adrenergic receptor
Synonyms:
ADA2A_BOVIN Alpha-2A adrenergic receptor Alpha-2A adrenoreceptor Alpha-2D adrenergic receptor Cerebral cortex alpha adrenergic receptor adrenergic Alpha2D
Type:
Enzyme Catalytic Domain
Mol. Mass.:
49275.13
Organism:
BOVINE
Description:
adrenergic Alpha2 0 BOVINE::Q28838
Residue:
452
  
Inhibitor
Name:
BDBM50002147
Synonyms:
8-Piperazin-1-yl-3-propyl-imidazo[1,2-a]pyrazine; 2M.hydrochloride | CHEMBL545293
Type:
Small organic molecule
Emp. Form.:
C13H19N5
Mol. Mass.:
245.3235
SMILES:
CCCc1cnc2c(nccn12)N1CCNCC1
: