Target
Vasopressin V1a receptor
Ligand
BDBM50406694
Substrate
Meas. Tech.
ChEBML_211234
IC50
1100±n/a nM
Citation
 Williams, PDBock, MGTung, RDGarsky, VMPerlow, DSErb, JMLundell, GFGould, NPWhitter, WLHoffman, JB Development of a novel class of cyclic hexapeptide oxytocin antagonists based on a natural product. J Med Chem 35:3905-18 (1992)  
Target
Name:
Vasopressin V1a receptor
Synonyms:
Avpr1a VASOPRESSIN V1A Vasopressin V1a receptor | Vasopressin receptor
Type:
Enzyme Catalytic Domain
Mol. Mass.:
47674.81
Organism:
RAT
Description:
VASOPRESSIN V1A AVPR1A RAT::P30560
Residue:
424
  
Inhibitor
Name:
BDBM50406694
Synonyms:
CHEMBL2112655
Type:
Small organic molecule
Emp. Form.:
C38H57N7O6
Mol. Mass.:
707.9025
SMILES:
CC[C@H](C)[C@@H]1NC(=O)[C@@H](Cc2ccccc2)NC(=O)[C@@H]2CCCN2C(=O)[C@@H](CCCCN)NC(=O)[C@@H]2CCCCN2C(=O)[C@H]2CCCCN2C1=O
: