Target
Oxytocin receptor
Ligand
BDBM50406692
Substrate
Meas. Tech.
ChEMBL_149049 (CHEMBL761404)
Ki
5.1±n/a nM
Citation
 Williams, PDBock, MGTung, RDGarsky, VMPerlow, DSErb, JMLundell, GFGould, NPWhitter, WLHoffman, JB Development of a novel class of cyclic hexapeptide oxytocin antagonists based on a natural product. J Med Chem 35:3905-18 (1992)  
Target
Name:
Oxytocin receptor
Synonyms:
OT-R OXYR_HUMAN | Oxytocin
Type:
Enzyme Catalytic Domain
Mol. Mass.:
42793.26
Organism:
Homo sapiens (Human)
Description:
Oxytocin OXTR HEK293::B2R9L7
Residue:
389
  
Inhibitor
Name:
BDBM50406692
Synonyms:
CHEMBL2112249
Type:
Small organic molecule
Emp. Form.:
C42H54N8O6
Mol. Mass.:
766.9282
SMILES:
CC[C@H](C)[C@@H]1NC(=O)[C@@H](Cc2ccc3ccccc3c2)NC(=O)[C@@H]2CCCN2C(=O)[C@@H](Cc2cnc[nH]2)NC(=O)[C@@H]2CCCCN2C(=O)[C@H]2CCCCN2C1=O
: