Target
Alpha-1A adrenergic receptor
Ligand
BDBM50368441
Substrate
Meas. Tech.
ChEMBL_32975 (CHEMBL644690)
IC50
900±n/a nM
Citation
 Elliott, JMSelnick, HGClaremon, DABaldwin, JJBuhrow, SAButcher, JWHabecker, CNKing, SWLynch, JJPhillips, BT 4-Oxospiro[benzopyran-2,4'-piperidines] as class III antiarrhythmic agents. Pharmacological studies on 3,4-dihydro-1'-[2-(benzofurazan-5-yl)- ethyl]-6-methanesulfonamidospiro[(2H)-1-benzopyran-2,4'-piperidin]-4-on e (L-691,121). J Med Chem 35:3973-6 (1992)  
Target
Name:
Alpha-1A adrenergic receptor
Synonyms:
ADA1A_BOVIN ADRA1C Alpha 1A-adrenoreceptor Cerebral cortex alpha adrenergic receptor | adrenergic Alpha1
Type:
Enzyme Catalytic Domain
Mol. Mass.:
51492.08
Organism:
CALF
Description:
adrenergic Alpha1 0 CALF
Residue:
466
  
Inhibitor
Name:
BDBM50368441
Synonyms:
CHEMBL1203302
Type:
Small organic molecule
Emp. Form.:
C22H25N3O6S
Mol. Mass.:
459.515
SMILES:
CS(=O)(=O)Nc1ccc2OC3(CCN(CCc4ccc(cc4)[N+]([O-])=O)CC3)CC(=O)c2c1
: