Target
Platelet-activating factor receptor
Ligand
BDBM50003539
Substrate
Meas. Tech.
ChEBML_154975
IC50
200000±n/a nM
Citation
 Carceller, EAlmansa, CMerlos, MGiral, MBartrolí, JGarcía-Rafanell, JForn, J (Pyridylcyanomethyl)piperazines as orally active PAF antagonists. J Med Chem 35:4118-34 (1992)  
Target
Name:
Platelet-activating factor receptor
Synonyms:
PAF-R PTAFR_CAVPO Platelet-activating factor receptor
Type:
Protein
Mol. Mass.:
39005.63
Organism:
Cavia porcellus
Description:
Residue:
342
  
Inhibitor
Name:
BDBM50003539
Synonyms:
2-(4-Diphenylacetyl-piperazin-1-yl)-2-pyridin-3-yl-acetamide | CHEMBL423717
Type:
Small organic molecule
Emp. Form.:
C25H26N4O2
Mol. Mass.:
414.4995
SMILES:
NC(=O)C(N1CCN(CC1)C(=O)C(c1ccccc1)c1ccccc1)c1cccnc1
: