Target
Platelet-activating factor receptor
Ligand
BDBM50003511
Substrate
Meas. Tech.
ChEBML_154975
IC50
240±n/a nM
Citation
 Carceller, EAlmansa, CMerlos, MGiral, MBartrolí, JGarcía-Rafanell, JForn, J (Pyridylcyanomethyl)piperazines as orally active PAF antagonists. J Med Chem 35:4118-34 (1992)  
Target
Name:
Platelet-activating factor receptor
Synonyms:
PAF-R PTAFR_CAVPO Platelet-activating factor receptor
Type:
Protein
Mol. Mass.:
39005.63
Organism:
Cavia porcellus
Description:
Residue:
342
  
Inhibitor
Name:
BDBM50003511
Synonyms:
(4-{2-[Methyl-(1-phenyl-ethyl)-amino]-acetyl}-piperazin-1-yl)-pyridin-3-yl-acetonitrile; trihydrochloride; hydrate | CHEMBL545306
Type:
Small organic molecule
Emp. Form.:
C22H27N5O
Mol. Mass.:
377.4827
SMILES:
CC(N(C)CC(=O)N1CCN(CC1)C(C#N)c1cccnc1)c1ccccc1
: