Target
Platelet-activating factor receptor
Ligand
BDBM50003496
Substrate
Meas. Tech.
ChEBML_154975
IC50
460±n/a nM
Citation
 Carceller, EAlmansa, CMerlos, MGiral, MBartrolí, JGarcía-Rafanell, JForn, J (Pyridylcyanomethyl)piperazines as orally active PAF antagonists. J Med Chem 35:4118-34 (1992)  
Target
Name:
Platelet-activating factor receptor
Synonyms:
PAF-R PTAFR_CAVPO Platelet-activating factor receptor
Type:
Protein
Mol. Mass.:
39005.63
Organism:
Cavia porcellus
Description:
Residue:
342
  
Inhibitor
Name:
BDBM50003496
Synonyms:
CHEMBL133425 | Pyridin-3-yl-{4-[2-(3,4,5-trimethoxy-phenyl)-acetyl]-piperazin-1-yl}-acetonitrile; hydrate
Type:
Small organic molecule
Emp. Form.:
C22H26N4O4
Mol. Mass.:
410.4662
SMILES:
COc1cc(CC(=O)N2CCN(CC2)C(C#N)c2cccnc2)cc(OC)c1OC
: