Target
Platelet-activating factor receptor
Ligand
BDBM50003503
Substrate
Meas. Tech.
ChEBML_154975
IC50
15±n/a nM
Citation
 Carceller, EAlmansa, CMerlos, MGiral, MBartrolí, JGarcía-Rafanell, JForn, J (Pyridylcyanomethyl)piperazines as orally active PAF antagonists. J Med Chem 35:4118-34 (1992)  
Target
Name:
Platelet-activating factor receptor
Synonyms:
PAF-R PTAFR_CAVPO Platelet-activating factor receptor
Type:
Protein
Mol. Mass.:
39005.63
Organism:
Cavia porcellus
Description:
Residue:
342
  
Inhibitor
Name:
BDBM50003503
Synonyms:
1-(3,3-Diphenyl-propionyl)-4-(pyridin-3-ylamino)-piperidine-4-carbonitrile; hydrate | CHEMBL335432
Type:
Small organic molecule
Emp. Form.:
C26H26N4O
Mol. Mass.:
410.5108
SMILES:
O=C(CC(c1ccccc1)c1ccccc1)N1CCC(CC1)(Nc1cccnc1)C#N
: