Target
Platelet-activating factor receptor
Ligand
BDBM50003498
Substrate
Meas. Tech.
ChEBML_154975
IC50
7400±n/a nM
Citation
 Carceller, EAlmansa, CMerlos, MGiral, MBartrolí, JGarcía-Rafanell, JForn, J (Pyridylcyanomethyl)piperazines as orally active PAF antagonists. J Med Chem 35:4118-34 (1992)  
Target
Name:
Platelet-activating factor receptor
Synonyms:
PAF-R PTAFR_CAVPO Platelet-activating factor receptor
Type:
Protein
Mol. Mass.:
39005.63
Organism:
Cavia porcellus
Description:
Residue:
342
  
Inhibitor
Name:
BDBM50003498
Synonyms:
3-{Cyano-[4-(3,3-diphenyl-propionyl)-piperazin-1-yl]-methyl}-benzonitrile | CHEMBL423711
Type:
Small organic molecule
Emp. Form.:
C28H26N4O
Mol. Mass.:
434.5322
SMILES:
O=C(CC(c1ccccc1)c1ccccc1)N1CCN(CC1)C(C#N)c1cccc(c1)C#N
: