Target
Sigma non-opioid intracellular receptor 1
Ligand
BDBM50002194
Substrate
Meas. Tech.
ChEBML_201877
Ki
4±n/a nM
Citation
 Gilligan, PJCain, GAChristos, TECook, LDrummond, SJohnson, ALKergaye, AAMcElroy, JFRohrbach, KWSchmidt, WK Novel piperidine sigma receptor ligands as potential antipsychotic drugs. J Med Chem 35:4344-61 (1992)  
Target
Name:
Sigma non-opioid intracellular receptor 1
Synonyms:
Opioid receptor, sigma 1 SGMR1_MOUSE Sigma1-receptor Sigmar1
Type:
Enzyme Catalytic Domain
Mol. Mass.:
25246.51
Organism:
Mus musculus (Mouse)
Description:
O55242
Residue:
223
  
Inhibitor
Name:
BDBM50002194
Synonyms:
4-(4-Fluoro-benzyloxymethyl)-1-phenethyl-piperidine; compound with but-2-enedioic acid | CHEMBL136963
Type:
Small organic molecule
Emp. Form.:
C21H26FNO
Mol. Mass.:
327.4356
SMILES:
Fc1ccc(COCC2CCN(CCc3ccccc3)CC2)cc1
: