Target
Sigma non-opioid intracellular receptor 1
Ligand
BDBM50002187
Substrate
Meas. Tech.
ChEBML_201877
Ki
3±n/a nM
Citation
 Gilligan, PJCain, GAChristos, TECook, LDrummond, SJohnson, ALKergaye, AAMcElroy, JFRohrbach, KWSchmidt, WK Novel piperidine sigma receptor ligands as potential antipsychotic drugs. J Med Chem 35:4344-61 (1992)  
Target
Name:
Sigma non-opioid intracellular receptor 1
Synonyms:
Opioid receptor, sigma 1 SGMR1_MOUSE Sigma1-receptor Sigmar1
Type:
Enzyme Catalytic Domain
Mol. Mass.:
25246.51
Organism:
Mus musculus (Mouse)
Description:
O55242
Residue:
223
  
Inhibitor
Name:
BDBM50002187
Synonyms:
1-(1-Benzyl-piperidin-4-yl)-2-(4-fluoro-phenyl)-ethanol; hydrochloride;0.25hydrate | CHEMBL545546
Type:
Small organic molecule
Emp. Form.:
C20H24FNO
Mol. Mass.:
313.4091
SMILES:
OC(Cc1ccc(F)cc1)C1CCN(Cc2ccccc2)CC1
: