Target
D(2) dopamine receptor
Ligand
BDBM50002215
Substrate
Meas. Tech.
ChEBML_58197
IC50
>10000±n/a nM
Citation
 Gilligan, PJCain, GAChristos, TECook, LDrummond, SJohnson, ALKergaye, AAMcElroy, JFRohrbach, KWSchmidt, WK Novel piperidine sigma receptor ligands as potential antipsychotic drugs. J Med Chem 35:4344-61 (1992)  
Target
Name:
D(2) dopamine receptor
Synonyms:
DOPAMINE D2 Dopamine D2 receptor Drd2
Type:
Enzyme
Mol. Mass.:
50957.64
Organism:
Mus musculus (Mouse)
Description:
P61168
Residue:
444
  
Inhibitor
Name:
BDBM50002215
Synonyms:
2-(1-Benzyl-piperidin-4-yl)-1-(4-trifluoromethyl-phenyl)-ethanol; hydrochloride | CHEMBL543437
Type:
Small organic molecule
Emp. Form.:
C21H24F3NO
Mol. Mass.:
363.4166
SMILES:
OC(CC1CCN(Cc2ccccc2)CC1)c1ccc(cc1)C(F)(F)F
: