Target
Sigma non-opioid intracellular receptor 1
Ligand
BDBM50002189
Substrate
Meas. Tech.
ChEBML_201877
Ki
4±n/a nM
Citation
 Gilligan, PJCain, GAChristos, TECook, LDrummond, SJohnson, ALKergaye, AAMcElroy, JFRohrbach, KWSchmidt, WK Novel piperidine sigma receptor ligands as potential antipsychotic drugs. J Med Chem 35:4344-61 (1992)  
Target
Name:
Sigma non-opioid intracellular receptor 1
Synonyms:
Opioid receptor, sigma 1 SGMR1_MOUSE Sigma1-receptor Sigmar1
Type:
Enzyme Catalytic Domain
Mol. Mass.:
25246.51
Organism:
Mus musculus (Mouse)
Description:
O55242
Residue:
223
  
Inhibitor
Name:
BDBM50002189
Synonyms:
2-(1-Benzyl-piperidin-4-yl)-1-(4-methoxy-phenyl)-ethanone | CHEMBL134578
Type:
Small organic molecule
Emp. Form.:
C21H25NO2
Mol. Mass.:
323.4287
SMILES:
COc1ccc(cc1)C(=O)CC1CCN(Cc2ccccc2)CC1
: