Target
Sigma non-opioid intracellular receptor 1
Ligand
BDBM50002292
Substrate
Meas. Tech.
ChEBML_201877
Ki
2±n/a nM
Citation
 Gilligan, PJCain, GAChristos, TECook, LDrummond, SJohnson, ALKergaye, AAMcElroy, JFRohrbach, KWSchmidt, WK Novel piperidine sigma receptor ligands as potential antipsychotic drugs. J Med Chem 35:4344-61 (1992)  
Target
Name:
Sigma non-opioid intracellular receptor 1
Synonyms:
Opioid receptor, sigma 1 SGMR1_MOUSE Sigma1-receptor Sigmar1
Type:
Enzyme Catalytic Domain
Mol. Mass.:
25246.51
Organism:
Mus musculus (Mouse)
Description:
O55242
Residue:
223
  
Inhibitor
Name:
BDBM50002292
Synonyms:
4-[4-(4-Fluoro-benzyloxymethyl)-piperidin-1-ylmethyl]-pyridine; compound with but-2-enedioic acid | CHEMBL134684
Type:
Small organic molecule
Emp. Form.:
C19H23FN2O
Mol. Mass.:
314.3971
SMILES:
Fc1ccc(COCC2CCN(Cc3ccncc3)CC2)cc1
: