Target
Sigma non-opioid intracellular receptor 1
Ligand
BDBM50002266
Substrate
Meas. Tech.
ChEBML_201877
Ki
5±n/a nM
Citation
 Gilligan, PJCain, GAChristos, TECook, LDrummond, SJohnson, ALKergaye, AAMcElroy, JFRohrbach, KWSchmidt, WK Novel piperidine sigma receptor ligands as potential antipsychotic drugs. J Med Chem 35:4344-61 (1992)  
Target
Name:
Sigma non-opioid intracellular receptor 1
Synonyms:
Opioid receptor, sigma 1 SGMR1_MOUSE Sigma1-receptor Sigmar1
Type:
Enzyme Catalytic Domain
Mol. Mass.:
25246.51
Organism:
Mus musculus (Mouse)
Description:
O55242
Residue:
223
  
Inhibitor
Name:
BDBM50002266
Synonyms:
1-Benzyl-4-(4-nitro-phenoxymethyl)-piperidine; hydrochloride | CHEMBL540578
Type:
Small organic molecule
Emp. Form.:
C19H22N2O3
Mol. Mass.:
326.3896
SMILES:
[O-][N+](=O)c1ccc(OCC2CCN(Cc3ccccc3)CC2)cc1
: