Target
Sigma non-opioid intracellular receptor 1
Ligand
BDBM50002260
Substrate
Meas. Tech.
ChEBML_201877
Ki
4±n/a nM
Citation
 Gilligan, PJCain, GAChristos, TECook, LDrummond, SJohnson, ALKergaye, AAMcElroy, JFRohrbach, KWSchmidt, WK Novel piperidine sigma receptor ligands as potential antipsychotic drugs. J Med Chem 35:4344-61 (1992)  
Target
Name:
Sigma non-opioid intracellular receptor 1
Synonyms:
Opioid receptor, sigma 1 SGMR1_MOUSE Sigma1-receptor Sigmar1
Type:
Enzyme Catalytic Domain
Mol. Mass.:
25246.51
Organism:
Mus musculus (Mouse)
Description:
O55242
Residue:
223
  
Inhibitor
Name:
BDBM50002260
Synonyms:
1-Cyclopropylmethyl-4-(2,4-dichloro-phenoxymethyl)-piperidine; hydrochloride | CHEMBL540322
Type:
Small organic molecule
Emp. Form.:
C16H21Cl2NO
Mol. Mass.:
314.25
SMILES:
Clc1ccc(OCC2CCN(CC3CC3)CC2)c(Cl)c1
: