Target
Adenosine receptor A1
Ligand
BDBM50368473
Substrate
Meas. Tech.
ChEMBL_29279 (CHEMBL640340)
EC50
5.754E4±n/a nM
Citation
 Niiya, KThompson, RDSilvia, SKOlsson, RA 2-(N'-aralkylidenehydrazino)adenosines: potent and selective coronary vasodilators. J Med Chem 35:4562-6 (1993)  
Target
Name:
Adenosine receptor A1
Synonyms:
A1 adenosine receptor ADENOSINE A1 ADENOSINE A1 low Adenosine A1 receptor | Adenosine Receptor A1
Type:
Enzyme Catalytic Domain
Mol. Mass.:
36501.39
Organism:
GUINEA PIG
Description:
ADENOSINE A1 ADORA1 GUINEA PIG::P47745
Residue:
326
  
Inhibitor
Name:
BDBM50368473
Synonyms:
CHEMBL607797
Type:
Small organic molecule
Emp. Form.:
C15H16BrN7O4S
Mol. Mass.:
470.301
SMILES:
Nc1nc(N=NCc2cc(Br)cs2)nc2n(cnc12)C1O[C@H](CO)[C@@H](O)[C@H]1O
: