Target
Adenosine receptor A1
Ligand
BDBM50368486
Substrate
Meas. Tech.
ChEMBL_29279 (CHEMBL640340)
EC50
4.365E4±n/a nM
Citation
 Niiya, KThompson, RDSilvia, SKOlsson, RA 2-(N'-aralkylidenehydrazino)adenosines: potent and selective coronary vasodilators. J Med Chem 35:4562-6 (1993)  
Target
Name:
Adenosine receptor A1
Synonyms:
A1 adenosine receptor ADENOSINE A1 ADENOSINE A1 low Adenosine A1 receptor | Adenosine Receptor A1
Type:
Enzyme Catalytic Domain
Mol. Mass.:
36501.39
Organism:
GUINEA PIG
Description:
ADENOSINE A1 ADORA1 GUINEA PIG::P47745
Residue:
326
  
Inhibitor
Name:
BDBM50368486
Synonyms:
CHEMBL608668
Type:
Small organic molecule
Emp. Form.:
C18H21N7O4
Mol. Mass.:
399.4038
SMILES:
Cc1ccccc1CN=Nc1nc(N)c2ncn(C3O[C@H](CO)[C@@H](O)[C@H]3O)c2n1
: