Target
Kappa-type opioid receptor
Ligand
BDBM50455774
Substrate
Meas. Tech.
ChEBML_145206
IC50
3.6±n/a nM
Citation
 Klein, PNelson, WL O3-(2-carbomethoxyallyl) ethers of opioid ligands derived from oxymorphone, naltrexone, etorphine, diprenorphine, norbinaltorphimine, and naltrindole. Unexpected O3-dealkylation in the opioid radioligand displacement assay. J Med Chem 35:4589-94 (1993)  
Target
Name:
Kappa-type opioid receptor
Synonyms:
Kappa Opioid Receptor OPRK1 Opiate Kappa 1 | mu/kappa opioid receptor
Type:
G Protein-Coupled Receptor (GPCR)
Mol. Mass.:
42744.99
Organism:
Cavia porcellus (domestic guinea pig)
Description:
P41144
Residue:
380
  
Inhibitor
Name:
BDBM50455774
Synonyms:
CHEMBL2092986
Type:
Small organic molecule
Emp. Form.:
C31H41NO6
Mol. Mass.:
523.6603
SMILES:
[H][C@@]12Oc3c4c(C[C@@]5([H])N(CC6CC6)CC[C@@]14[C@@]51CC[C@@]2(OC)[C@H](C1)C(C)(C)O)ccc3OCC(=C)C(=O)OC
: