Target
Kappa-type opioid receptor
Ligand
BDBM50001712
Substrate
Meas. Tech.
ChEBML_145206
IC50
42±n/a nM
Citation
 Klein, PNelson, WL O3-(2-carbomethoxyallyl) ethers of opioid ligands derived from oxymorphone, naltrexone, etorphine, diprenorphine, norbinaltorphimine, and naltrindole. Unexpected O3-dealkylation in the opioid radioligand displacement assay. J Med Chem 35:4589-94 (1993)  
Target
Name:
Kappa-type opioid receptor
Synonyms:
Kappa Opioid Receptor OPRK1 Opiate Kappa 1 | mu/kappa opioid receptor
Type:
G Protein-Coupled Receptor (GPCR)
Mol. Mass.:
42744.99
Organism:
Cavia porcellus (domestic guinea pig)
Description:
P41144
Residue:
380
  
Inhibitor
Name:
BDBM50001712
Synonyms:
CHEMBL143416 | methyl 2-[4-cyclopropylmethyl-17-hydroxy-10-(2-methyloxycarbonylallyloxy)-12-oxa-4-azapentacyclo[9.6.1.01,13.05,17.07,18]octadeca-7,9,11(18)-trien-14-yloxymethyl]acrylate
Type:
Small organic molecule
Emp. Form.:
C30H37NO8
Mol. Mass.:
539.6167
SMILES:
COC(=O)C(=C)CO[C@@H]1CC[C@@]2(O)[C@H]3Cc4ccc(OCC(=C)C(=O)OC)c5O[C@@H]1[C@]2(CCN3CC1CC1)c45
: