Target
Sigma non-opioid intracellular receptor 1
Ligand
BDBM83449
Substrate
Meas. Tech.
ChEMBL_226545 (CHEMBL846485)
IC50
1000±n/a nM
Citation
 Kimes, ASWilson, AAScheffel, UCampbell, BGLondon, ED Radiosynthesis, cerebral distribution, and binding of [125I]-1-(p-iodophenyl)-3-(1-adamantyl)guanidine, a ligand for sigma binding sites. J Med Chem 35:4683-9 (1993)  
Target
Name:
Sigma non-opioid intracellular receptor 1
Synonyms:
Aging-associated gene 8 protein SGMR1_HUMAN SIGMAR1 SR31747-binding protein Sigma 1-type opioid receptor Sigma1R | hSigmaR1
Type:
Enzyme Catalytic Domain
Mol. Mass.:
25124.85
Organism:
Homo sapiens (Human)
Description:
Q99720
Residue:
223
  
Inhibitor
Name:
BDBM83449
Synonyms:
1-(1-phenylcyclohexyl)piperidine;hydrochloride PCP PHENCYCLIDINE SMR001338811 | cid_9795678
Type:
Small organic molecule
Emp. Form.:
C17H25N
Mol. Mass.:
243.3871
SMILES:
C1CCN(CC1)C1(CCCCC1)c1ccccc1
: