Target
Sigma non-opioid intracellular receptor 1
Ligand
BDBM21398
Substrate
Meas. Tech.
ChEMBL_226545 (CHEMBL846485)
IC50
17±n/a nM
Citation
 Kimes, ASWilson, AAScheffel, UCampbell, BGLondon, ED Radiosynthesis, cerebral distribution, and binding of [125I]-1-(p-iodophenyl)-3-(1-adamantyl)guanidine, a ligand for sigma binding sites. J Med Chem 35:4683-9 (1993)  
Target
Name:
Sigma non-opioid intracellular receptor 1
Synonyms:
Aging-associated gene 8 protein SGMR1_HUMAN SIGMAR1 SR31747-binding protein Sigma 1-type opioid receptor Sigma1R | hSigmaR1
Type:
Enzyme Catalytic Domain
Mol. Mass.:
25124.85
Organism:
Homo sapiens (Human)
Description:
Q99720
Residue:
223
  
Inhibitor
Name:
BDBM21398
Synonyms:
4-[4-(4-Chloro-phenyl)-4-hydroxy-piperidin-1-yl]-1-(4-fluoro-phenyl)-butan-1-one;propionate(HCl) CHEMBL54 Haloperidol | Haloperidol, 1
Type:
Small organic molecule
Emp. Form.:
C21H23ClFNO2
Mol. Mass.:
375.864
SMILES:
OC1(CCN(CCCC(=O)c2ccc(F)cc2)CC1)c1ccc(Cl)cc1
: