Target
Type-1 angiotensin II receptor B
Ligand
BDBM50004153
Substrate
Meas. Tech.
ChEBML_217980
Ki
41±n/a nM
Citation
 Atwal, KSAhmed, SZBird, JEDelaney, CLDickinson, KEFerrara, FNHedberg, AMiller, AVMoreland, SO'Reilly, BC Dihydropyrimidine angiotensin II receptor antagonists. J Med Chem 35:4751-63 (1993)  
Target
Name:
Type-1 angiotensin II receptor B
Synonyms:
AGTRB_RAT Agtr1 Angiotensin II AT1B Angiotensin II type 1b (AT-1b) receptor Type-1B angiotensin II receptor
Type:
Enzyme Catalytic Domain
Mol. Mass.:
40929.44
Organism:
RAT
Description:
Angiotensin II AT1B 0 RAT::P29089
Residue:
359
  
Inhibitor
Name:
BDBM50004153
Synonyms:
2-Butyl-1-(2'-carboxy-biphenyl-4-ylmethyl)-4-chloro-6-methyl-1,6-dihydro-pyrimidine-5-carboxylic acid ethyl ester | CHEMBL343251
Type:
Small organic molecule
Emp. Form.:
C26H29ClN2O4
Mol. Mass.:
468.972
SMILES:
CCCCC1=NC(Cl)=C(C(C)N1Cc1ccc(cc1)-c1ccccc1C(O)=O)C(=O)OCC
: