Target
Reverse transcriptase/RNaseH
Ligand
BDBM50143421
Substrate
Meas. Tech.
ChEBML_196935
IC50
125000±n/a nM
Citation
 Tan, GTWickramasinghe, ABaba, MHughes, SHMohan, PPezzuto, JMSingh, RVerma, S Potential anti-AIDS naphthalenesulfonic acid derivatives. Synthesis and inhibition of HIV-1 induced cytopathogenesis and HIV-1 and HIV-2 reverse transcriptase activities. J Med Chem 35:4846-53 (1992)  
Target
Name:
Reverse transcriptase/RNaseH
Synonyms:
HIV-1 Reverse Transcriptase RNase H Reverse transcriptase/RNaseH
Type:
PROTEIN
Mol. Mass.:
65229.15
Organism:
Human immunodeficiency virus 1
Description:
ChEMBL_1473730
Residue:
566
  
Inhibitor
Name:
BDBM50143421
Synonyms:
CHEMBL425511 | Di sodium; 4,5-Dihydroxy-7-sulfo-naphthalene-2-sulfonic acid
Type:
Small organic molecule
Emp. Form.:
C10H6O8S2
Mol. Mass.:
318.281
SMILES:
Oc1cc(cc2cc(cc(O)c12)S([O-])(=O)=O)S([O-])(=O)=O
: