Target
Neutrophil elastase
Ligand
BDBM50005174
Substrate
Meas. Tech.
ChEBML_63659
IC50
61±n/a nM
Citation
 Skiles, JWFuchs, VMiao, CSorcek, RGrozinger, KGMauldin, SCVitous, JMui, PWJacober, SChow, G Inhibition of human leukocyte elastase (HLE) by N-substituted peptidyl trifluoromethyl ketones. J Med Chem 35:641-62 (1992)  
Target
Name:
Neutrophil elastase
Synonyms:
Bone marrow serine protease Coagulation factor X ELANE Elastase HLE Leukocyte elastase Medullasin Neutrophil elastase (HNE) PMN elastase Trypsin
Type:
Enzyme
Mol. Mass.:
28532.38
Organism:
Homo sapiens (Human)
Description:
P08246
Residue:
267
  
Inhibitor
Name:
BDBM50005174
Synonyms:
CHEMBL435649 | N-(1-{Bicyclo[2.2.1]hept-2-yl-[(3,3,3-trifluoro-1-isopropyl-2-oxo-propylcarbamoyl)-methyl]-carbamoyl}-2-methyl-propyl)-4-(4-chloro-benzenesulfonylaminocarbonyl)-benzamide
Type:
Small organic molecule
Emp. Form.:
C34H40ClF3N4O7S
Mol. Mass.:
741.217
SMILES:
CC(C)C(NC(=O)c1ccc(cc1)C(=O)NS(=O)(=O)c1ccc(Cl)cc1)C(=O)N(CC(=O)NC(C(C)C)C(=O)C(F)(F)F)C1CC2CCC1C2
: