Target
5-hydroxytryptamine receptor 2C
Ligand
BDBM50005250
Substrate
Meas. Tech.
ChEBML_1861
Ki
1935±n/a nM
Citation
 Glennon, RARaghupathi, RBartyzel, PTeitler, MLeonhardt, S Binding of phenylalkylamine derivatives at 5-HT1C and 5-HT2 serotonin receptors: evidence for a lack of selectivity. J Med Chem 35:734-40 (1992)  
Target
Name:
5-hydroxytryptamine receptor 2C
Synonyms:
5-HT2C 5-hydroxytryptamine receptor 2C (5HT2c) 5ht1c Htr2c Serotonin receptor 2a and 2c (5HT2A and 5HT2C)
Type:
Enzyme
Mol. Mass.:
51935.10
Organism:
Rattus norvegicus (Rat)
Description:
P08909
Residue:
460
  
Inhibitor
Name:
BDBM50005250
Synonyms:
CHEMBL163814 | Methyl-[1-methyl-2-(4-propyl-phenyl)-ethyl]-amine
Type:
Small organic molecule
Emp. Form.:
C13H21N
Mol. Mass.:
191.3125
SMILES:
CCCc1ccc(CC(C)NC)cc1
: