Target
Aminopeptidase B
Ligand
BDBM50368567
Substrate
Meas. Tech.
ChEMBL_35342 (CHEMBL646060)
IC50
500000±n/a nM
Citation
 Herranz, RVinuesa, SPérez, CGarcía-López, MTLópez, Ede Ceballos, MLDel Río, J Analgesic dipeptide derivatives. 7. 3,7-Diamino-2-hydroxyheptanoic acid (DAHHA) containing dipeptide analogues of the analgesic compound H-Lys-Trp(Nps)-OMe. J Med Chem 35:889-95 (1992)  
Target
Name:
Aminopeptidase B
Synonyms:
AMPB_RAT Arginine aminopeptidase Cytosol aminopeptidase IV | Rnpep
Type:
PROTEIN
Mol. Mass.:
72609.93
Organism:
Rattus norvegicus
Description:
ChEMBL_1344423
Residue:
650
  
Inhibitor
Name:
BDBM50368567
Synonyms:
CHEMBL1794905
Type:
Small organic molecule
Emp. Form.:
C14H29N3O4
Mol. Mass.:
303.3978
SMILES:
COC(=O)[C@H](CC(C)C)NC(=O)[C@H](O)[C@@H](N)CCCCN
: