Target
Aminopeptidase N
Ligand
BDBM50368569
Substrate
Meas. Tech.
ChEMBL_35368 (CHEMBL647949)
IC50
>1000000±n/a nM
Citation
 Herranz, RVinuesa, SPérez, CGarcía-López, MTLópez, Ede Ceballos, MLDel Río, J Analgesic dipeptide derivatives. 7. 3,7-Diamino-2-hydroxyheptanoic acid (DAHHA) containing dipeptide analogues of the analgesic compound H-Lys-Trp(Nps)-OMe. J Med Chem 35:889-95 (1992)  
Target
Name:
Aminopeptidase N
Synonyms:
AMPN_RAT | Anpep
Type:
PROTEIN
Mol. Mass.:
109431.53
Organism:
Rattus norvegicus
Description:
ChEMBL_35366
Residue:
965
  
Inhibitor
Name:
BDBM50368569
Synonyms:
CHEMBL1794904
Type:
Small organic molecule
Emp. Form.:
C19H28N4O4
Mol. Mass.:
376.45
SMILES:
COC(=O)[C@H](Cc1c[nH]c2ccccc12)NC(=O)[C@H](O)[C@@H](N)CCCCN
: