Target
Adenosine receptor A2a/A2b
Ligand
BDBM82032
Substrate
Meas. Tech.
ChEMBL_30567 (CHEMBL649879)
Ki
2400±n/a nM
Citation
 Shimada, JSuzuki, FNonaka, HIshii, A 8-Polycycloalkyl-1,3-dipropylxanthines as potent and selective antagonists for A1-adenosine receptors. J Med Chem 35:924-30 (1992)  
Target
Name:
Adenosine receptor A2a/A2b
Synonyms:
Adenosine A2 receptor
Type:
Mol. Mass.:
Description:
ASSAY_ID of ChEMBL is 30560
Components:
This complex has 2 components.
Component 1
Name:
Adenosine receptor A2b
Synonyms:
AA2BR_RAT Adora2b
Type:
PROTEIN
Mol. Mass.:
36378.84
Organism:
Rattus norvegicus
Description:
ChEMBL_32934
Residue:
332
  
Component 2
Name:
Adenosine receptor A2a
Synonyms:
AA2AR_RAT Adenosine A2 receptor Adenosine Receptors A2a (A2a) Adenosine receptors A2a Rat striatal adenosine A2a receptor
Type:
G Protein-Coupled Receptor (GPCR)
Mol. Mass.:
45015.65
Organism:
Rattus norvegicus (rat)
Description:
Rat A2A receptors expressed in CHO cells.
Residue:
410
  
Inhibitor
Name:
BDBM82032
Synonyms:
1,3-Dipropyl-3,7-dihydro-purine-2,6-dione CAS_169317 CPX | NSC_169317
Type:
Small organic molecule
Emp. Form.:
C11H16N4O2
Mol. Mass.:
236.2703
SMILES:
CCCn1c2nc[nH]c2c(=O)n(CCC)c1=O
: