Target
Alpha-1A/Alpha-1B/Alpha-1D adrenergic receptor
Ligand
BDBM50000496
Substrate
Meas. Tech.
ChEMBL_34591 (CHEMBL645550)
Ki
15000±n/a nM
Citation
 Macchia, BBalsamo, ABreschi, MCLapucci, ALucacchini, AMacchia, FManera, CMartinelli, AMartini, CMartinotti, E Conformational effects on the activity of drugs. 13. A revision of previously proposed models for the activation of alpha- and beta-adrenergic receptors. J Med Chem 35:1009-18 (1992)  
Target
Name:
Alpha-1A/Alpha-1B/Alpha-1D adrenergic receptor
Synonyms:
Adrenergic receptor alpha-1 alpha-1 Adrenergic Receptor
Type:
Mol. Mass.:
Description:
ASSAY_ID of EBI is 303470
Components:
This complex has 3 components.
Component 1
Name:
Alpha-1B adrenergic receptor
Synonyms:
ADA1B_RAT Alpha 1B-adrenoceptor Alpha adrenergic receptor 1A and 1B Alpha-1Adrenoceptor Alpha-1B adrenoreceptor | adrenergic Alpha1B
Type:
G Protein-Coupled Receptor (GPCR)
Mol. Mass.:
56606.71
Organism:
Rattus norvegicus (rat)
Description:
Receptor binding assays were performed using rat cortical membranes.
Residue:
515
  
Component 2
Name:
Alpha-1A adrenergic receptor
Synonyms:
ADA1A_RAT Adra1c Alpha-1A adrenoceptor Alpha-1C adrenergic receptor | adrenergic Alpha1A
Type:
Protein
Mol. Mass.:
51620.15
Organism:
Rattus norvegicus (Rat)
Description:
P43140
Residue:
466
  
Component 3
Name:
Alpha-1D adrenergic receptor
Synonyms:
ADA1D_RAT Adra1d Alpha-1D adrenergic receptor | Serotonin 1a (5-HT1a) receptor/Adrenergic receptor alpha-1
Type:
Protein
Mol. Mass.:
59375.97
Organism:
Rattus norvegicus (Rat)
Description:
P23944
Residue:
561
  
Inhibitor
Name:
BDBM50000496
Synonyms:
4-(3-Hydroxy-piperidin-3-yl)-benzene-1,2-diol | CHEMBL7278
Type:
Small organic molecule
Emp. Form.:
C11H15NO3
Mol. Mass.:
209.2417
SMILES:
Oc1ccc(cc1O)C1(O)CCCNC1
: