Target
D(2) dopamine receptor
Ligand
BDBM50001958
Substrate
Meas. Tech.
ChEMBL_62419 (CHEMBL674823)
Ki
>1000±n/a nM
Citation
 Moon, MWMorris, JKHeier, RFChidester, CGHoffmann, WEPiercey, MFAlthaus, JSVon Voigtlander, PFEvans, DLFigur, LM Dopaminergic and serotonergic activities of imidazoquinolinones and related compounds. J Med Chem 35:1076-92 (1992)  
Target
Name:
D(2) dopamine receptor
Synonyms:
DOPAMINE D2 DOPAMINE D2 Short Dopamine D2 receptor Drd2
Type:
G Protein-Coupled Receptor (GPCR)
Mol. Mass.:
50931.60
Organism:
Rattus norvegicus (rat)
Description:
P61169
Residue:
444
  
Inhibitor
Name:
BDBM50001958
Synonyms:
(2-Methylsulfanyl-5,6-dihydro-4H-imidazo[4,5,1-ij]quinolin-5-yl)-dipropyl-amine | CHEMBL267107
Type:
Small organic molecule
Emp. Form.:
C17H25N3S
Mol. Mass.:
303.465
SMILES:
CCCN(CCC)C1Cc2cccc3nc(SC)n(C1)c23
: