Target
Muscarinic acetylcholine receptor M2
Ligand
BDBM8961
Substrate
Meas. Tech.
ChEMBL_139893 (CHEMBL744480)
IC50
2100±n/a nM
Citation
 Sowell, JWTang, YValli, MJChapman, JMUsher, LAVaughan, CMKosh, JW Synthesis and cholinergic properties of bis[[(dimethylamino)methyl]furanyl] analogues of ranitidine. J Med Chem 35:1102-8 (1992)  
Target
Name:
Muscarinic acetylcholine receptor M2
Synonyms:
ACM2_MOUSE Chrm2 | Muscarinic acetylcholine receptor
Type:
PROTEIN
Mol. Mass.:
51515.43
Organism:
Mus musculus
Description:
ChEMBL_139897
Residue:
466
  
Inhibitor
Name:
BDBM8961
Synonyms:
1,2,3,4-tetrahydro-9-acridinamine 9-THA CHEMBL1337960 Cognex Tracine cid_1935 | tacrine.HCl
Type:
Small organic molecule
Emp. Form.:
C13H14N2
Mol. Mass.:
198.2637
SMILES:
Nc1c2CCCCc2nc2ccccc12
: