Target
Cholinesterase
Ligand
BDBM50005503
Substrate
Meas. Tech.
ChEMBL_41721 (CHEMBL659267)
IC50
4300±n/a nM
Citation
 Sowell, JWTang, YValli, MJChapman, JMUsher, LAVaughan, CMKosh, JW Synthesis and cholinergic properties of bis[[(dimethylamino)methyl]furanyl] analogues of ranitidine. J Med Chem 35:1102-8 (1992)  
Target
Name:
Cholinesterase
Synonyms:
Acylcholine acylhydrolase Butyrylcholine esterase (BChE) Butyrylcholinesterase (BuChE) CHLE_HUMAN Cholinesterases Pseudocholinesterase
Type:
Homotetramer
Mol. Mass.:
68422.27
Organism:
Homo sapiens (Human)
Description:
P06276
Residue:
602
  
Inhibitor
Name:
BDBM50005503
Synonyms:
CHEMBL13308 | {5-[2-(5-Dimethylaminomethyl-furan-2-ylmethylsulfanyl)-ethylsulfanylmethyl]-furan-2-ylmethyl}-dimethyl-amine
Type:
Small organic molecule
Emp. Form.:
C18H28N2O2S2
Mol. Mass.:
368.557
SMILES:
CN(C)Cc1ccc(CSCCSCc2ccc(CN(C)C)o2)o1
: