Target
Acetylcholinesterase
Ligand
BDBM50005494
Substrate
Meas. Tech.
ChEMBL_28634 (CHEMBL644790)
IC50
470±n/a nM
Citation
 Sowell, JWTang, YValli, MJChapman, JMUsher, LAVaughan, CMKosh, JW Synthesis and cholinergic properties of bis[[(dimethylamino)methyl]furanyl] analogues of ranitidine. J Med Chem 35:1102-8 (1992)  
Target
Name:
Acetylcholinesterase
Synonyms:
ACES_HUMAN Acetylcholinesterase (AChE) | Acetylcholinesterase (human AChE)
Type:
Enzyme
Mol. Mass.:
67792.70
Organism:
Homo sapiens (Human)
Description:
P22303
Residue:
614
  
Inhibitor
Name:
BDBM50005494
Synonyms:
CHEMBL418714 | {5-[8-(5-Dimethylaminomethyl-furan-2-ylmethylsulfanyl)-octylsulfanylmethyl]-furan-2-ylmethyl}-dimethyl-amine
Type:
Small organic molecule
Emp. Form.:
C24H40N2O2S2
Mol. Mass.:
452.717
SMILES:
CN(C)Cc1ccc(CSCCCCCCCCSCc2ccc(CN(C)C)o2)o1
: