Target
Acetylcholinesterase
Ligand
BDBM50403547
Substrate
Meas. Tech.
ChEBML_28926
Ki
0.350000±n/a nM
Citation
 Sowell, JWTang, YValli, MJChapman, JMUsher, LAVaughan, CMKosh, JW Synthesis and cholinergic properties of bis[[(dimethylamino)methyl]furanyl] analogues of ranitidine. J Med Chem 35:1102-8 (1992)  
Target
Name:
Acetylcholinesterase
Synonyms:
ACES_MOUSE Acetylcholinesterase (mouse AChE) Ache
Type:
Enzyme
Mol. Mass.:
68165.65
Organism:
Mus musculus (mouse)
Description:
Residue:
614
  
Inhibitor
Name:
BDBM50403547
Synonyms:
ATROPEN | ATROPINE
Type:
Small organic molecule
Emp. Form.:
C17H23NO3
Mol. Mass.:
289.3694
SMILES:
CN1[C@H]2CC[C@@H]1C[C@@H](C2)OC(=O)C(CO)c1ccccc1
: