Target
Sodium-dependent dopamine transporter
Ligand
BDBM50011397
Substrate
Meas. Tech.
ChEMBL_62169 (CHEMBL675166)
IC50
37±n/a nM
Citation
 Carroll, FILewin, AHBoja, JWKuhar, MJ Cocaine receptor: biochemical characterization and structure-activity relationships of cocaine analogues at the dopamine transporter. J Med Chem 35:969-81 (1992)  
Target
Name:
Sodium-dependent dopamine transporter
Synonyms:
DA transporter SC6A3_RAT Sodium-dependent dopamine transporter | Sodium-dependent dopamine transporter (DAT)
Type:
Multi-pass membrane protein
Mol. Mass.:
68749.45
Organism:
Rattus norvegicus (rat)
Description:
P23977
Residue:
619
  
Inhibitor
Name:
BDBM50011397
Synonyms:
8-Methyl-3-(3-nitro-phenylcarbamoyloxy)-8-aza-bicyclo[3.2.1]octane-2-carboxylic acid methyl ester | CHEMBL159325
Type:
Small organic molecule
Emp. Form.:
C17H21N3O6
Mol. Mass.:
363.3651
SMILES:
COC(=O)C1C2CC[C@H](C[C@@H]1OC(=O)Nc1cccc(c1)[N+]([O-])=O)N2C
: