Target
Sodium-dependent dopamine transporter
Ligand
BDBM50005534
Substrate
Meas. Tech.
ChEMBL_62165 (CHEMBL675008)
IC50
20±n/a nM
Citation
 Carroll, FILewin, AHBoja, JWKuhar, MJ Cocaine receptor: biochemical characterization and structure-activity relationships of cocaine analogues at the dopamine transporter. J Med Chem 35:969-81 (1992)  
Target
Name:
Sodium-dependent dopamine transporter
Synonyms:
DA transporter SC6A3_RAT Sodium-dependent dopamine transporter | Sodium-dependent dopamine transporter (DAT)
Type:
Multi-pass membrane protein
Mol. Mass.:
68749.45
Organism:
Rattus norvegicus (rat)
Description:
P23977
Residue:
619
  
Inhibitor
Name:
BDBM50005534
Synonyms:
1-(1-(benzo[b]thiophen-2-yl)cyclohexyl)piperidine 1-(1-Benzo[b]thiophen-2-yl-cyclohexyl)-piperidine(BTCP) 3-[(3-Chloro-phenyl)-phenyl-methoxy]-8-methyl-8-aza-bicyclo[3.2.1]octane | CHEMBL279556
Type:
Small organic molecule
Emp. Form.:
C19H25NS
Mol. Mass.:
299.474
SMILES:
C1CCN(CC1)C1(CCCCC1)c1cc2ccccc2s1
: