Target
Sodium-dependent dopamine transporter
Ligand
BDBM50005549
Substrate
Meas. Tech.
ChEMBL_62800 (CHEMBL674113)
IC50
800±n/a nM
Citation
 Carroll, FILewin, AHBoja, JWKuhar, MJ Cocaine receptor: biochemical characterization and structure-activity relationships of cocaine analogues at the dopamine transporter. J Med Chem 35:969-81 (1992)  
Target
Name:
Sodium-dependent dopamine transporter
Synonyms:
DA transporter SC6A3_RAT Sodium-dependent dopamine transporter | Sodium-dependent dopamine transporter (DAT)
Type:
Multi-pass membrane protein
Mol. Mass.:
68749.45
Organism:
Rattus norvegicus (rat)
Description:
P23977
Residue:
619
  
Inhibitor
Name:
BDBM50005549
Synonyms:
CHEMBL174568 | methyl 3-(4-azido-3-iodophenylcarbonyloxy)-8-methyl-(3S,5R)-8-azabicyclo[3.2.1]octane-2-carboxylate
Type:
Small organic molecule
Emp. Form.:
C17H19IN4O4
Mol. Mass.:
470.2616
SMILES:
COC(=O)C1C2CC[C@H](C[C@@H]1OC(=O)c1ccc(N=[N+]=[N-])c(I)c1)N2C
: