Target
Aminopeptidase N
Ligand
BDBM50002030
Substrate
Meas. Tech.
ChEMBL_35492 (CHEMBL646402)
IC50
45±n/a nM
Citation
 Fournié-Zaluski, MCCoric, PTurcaud, SBruetschy, LLucas, ENoble, FRoques, BP Potent and systemically active aminopeptidase N inhibitors designed from active-site investigation. J Med Chem 35:1259-66 (1992)  
Target
Name:
Aminopeptidase N
Synonyms:
AMPN_PIG AP-M Alanyl aminopeptidase Aminopeptidase N (APN) Microsomal aminopeptidase pAPN
Type:
Protein
Mol. Mass.:
108810.25
Organism:
Sus scrofa (Pig)
Description:
P15145
Residue:
963
  
Inhibitor
Name:
BDBM50002030
Synonyms:
2-Cyclohexyl-1-mercaptomethyl-ethyl-ammonium
Type:
Small organic molecule
Emp. Form.:
C9H20NS
Mol. Mass.:
174.326
SMILES:
[NH3+]C(CS)CC1CCCCC1
: