Target
Aminopeptidase N
Ligand
BDBM50002019
Substrate
Meas. Tech.
ChEBML_35491
IC50
40±n/a nM
Citation
 Fournié-Zaluski, MCCoric, PTurcaud, SBruetschy, LLucas, ENoble, FRoques, BP Potent and systemically active aminopeptidase N inhibitors designed from active-site investigation. J Med Chem 35:1259-66 (1992)  
Target
Name:
Aminopeptidase N
Synonyms:
AMPN_PIG AP-M Alanyl aminopeptidase Aminopeptidase N (APN) Microsomal aminopeptidase pAPN
Type:
Protein
Mol. Mass.:
108810.25
Organism:
Sus scrofa (Pig)
Description:
P15145
Residue:
963
  
Inhibitor
Name:
BDBM50002019
Synonyms:
2-tert-Butylsulfanyl-1-mercaptomethyl-ethyl-ammonium
Type:
Small organic molecule
Emp. Form.:
C7H18NS2
Mol. Mass.:
180.354
SMILES:
CC(C)(C)SCC([NH3+])CS
: