Target
Aminopeptidase N
Ligand
BDBM50368598
Substrate
Meas. Tech.
ChEBML_35491
IC50
21±n/a nM
Citation
 Fournié-Zaluski, MCCoric, PTurcaud, SBruetschy, LLucas, ENoble, FRoques, BP Potent and systemically active aminopeptidase N inhibitors designed from active-site investigation. J Med Chem 35:1259-66 (1992)  
Target
Name:
Aminopeptidase N
Synonyms:
AMPN_PIG AP-M Alanyl aminopeptidase Aminopeptidase N (APN) Microsomal aminopeptidase pAPN
Type:
Protein
Mol. Mass.:
108810.25
Organism:
Sus scrofa (Pig)
Description:
P15145
Residue:
963
  
Inhibitor
Name:
BDBM50368598
Synonyms:
CHEMBL1159810
Type:
Small organic molecule
Emp. Form.:
C4H11NOS2
Mol. Mass.:
153.266
SMILES:
CS(=O)CC(N)CS
: