Target
Gag-Pol polyprotein [489-587]
Ligand
BDBM50407048
Substrate
Meas. Tech.
ChEMBL_159480 (CHEMBL769440)
IC50
27±n/a nM
Citation
 Tam, TFCarrière, JMacDonald, DCastelhano, ALPliura, DHDewdney, NJThomas, EMBach, CBarnett, JChan, H Intriguing structure-activity relations underlie the potent inhibition of HIV protease by norstatine-based peptides. J Med Chem 35:1318-20 (1992)  
Target
Name:
Gag-Pol polyprotein [489-587]
Synonyms:
Human immunodeficiency virus type 1 protease Pol polyprotein | gag-pol
Type:
Enzyme Subunit
Mol. Mass.:
10781.16
Organism:
Human immunodeficiency virus type 1
Description:
P04585[489-587]
Residue:
99
  
Inhibitor
Name:
BDBM50407048
Synonyms:
CHEMBL3085513
Type:
Small organic molecule
Emp. Form.:
C38H48N6O6
Mol. Mass.:
684.8243
SMILES:
[H][C@@]12CCCC[C@]1([H])CN([C@@H](C2)C(=O)NC(C)(C)C)C(=O)[C@@H](O)[C@H](Cc1ccccc1)NC(=O)[C@H](CC(N)=O)NC(=O)c1ccc2ccccc2n1
: