Target
Gag-Pol polyprotein [489-587]
Ligand
BDBM50005702
Substrate
Meas. Tech.
ChEMBL_159483 (CHEMBL769443)
IC50
460±n/a nM
Citation
 Tam, TFCarrière, JMacDonald, DCastelhano, ALPliura, DHDewdney, NJThomas, EMBach, CBarnett, JChan, H Intriguing structure-activity relations underlie the potent inhibition of HIV protease by norstatine-based peptides. J Med Chem 35:1318-20 (1992)  
Target
Name:
Gag-Pol polyprotein [489-587]
Synonyms:
Human immunodeficiency virus type 1 protease Pol polyprotein | gag-pol
Type:
Enzyme Subunit
Mol. Mass.:
10781.16
Organism:
Human immunodeficiency virus type 1
Description:
P04585[489-587]
Residue:
99
  
Inhibitor
Name:
BDBM50005702
Synonyms:
BDBM50407040 [1-Benzyl-3-(2-tert-butylcarbamoyl-pyrrolidin-1-yl)-2-hydroxy-3-oxo-propyl]-carbamic acid benzyl ester
Type:
Small organic molecule
Emp. Form.:
C27H35N3O5
Mol. Mass.:
481.5839
SMILES:
CC(C)(C)NC(=O)[C@@H]1CCCN1C(=O)[C@@H](O)[C@H](Cc1ccccc1)NC(=O)OCc1ccccc1
: