Target
Aromatase
Ligand
BDBM50406730
Substrate
Meas. Tech.
ChEMBL_51023 (CHEMBL664580)
Ki
169±n/a nM
Citation
 Lesuisse, DGourvest, JFHartmann, CTric, BBenslimane, OPhilibert, DVevert, JP Synthesis and evaluation of a new series of mechanism-based aromatase inhibitors. J Med Chem 35:1588-97 (1992)  
Target
Name:
Aromatase
Synonyms:
ARO1 CP19A_HUMAN CYP19 CYPXIX Cytochrome P450 19A1 Cytochrome P450-C19 (CYP19) FL cytokine receptor precursor | P-450AROM
Type:
Enzyme
Mol. Mass.:
57888.92
Organism:
Homo sapiens (Human)
Description:
P11511
Residue:
503
  
Inhibitor
Name:
BDBM50406730
Synonyms:
CHEMBL2113619
Type:
Small organic molecule
Emp. Form.:
C21H27NO2S
Mol. Mass.:
357.51
SMILES:
C[C@]12CC[C@H]3[C@@H](CCC4=C(SCC#N)C(=O)CC[C@]34C)[C@@H]1CCC2=O
: