Target
Neutrophil elastase
Ligand
BDBM50005888
Substrate
Meas. Tech.
ChEBML_63648
IC50
6100±n/a nM
Citation
 Zembower, DEKam, CMPowers, JCZalkow, LH Novel anthraquinone inhibitors of human leukocyte elastase and cathepsin G. J Med Chem 35:1597-605 (1992)  
Target
Name:
Neutrophil elastase
Synonyms:
Bone marrow serine protease Coagulation factor X ELANE Elastase HLE Leukocyte elastase Medullasin Neutrophil elastase (HNE) PMN elastase Trypsin
Type:
Enzyme
Mol. Mass.:
28532.38
Organism:
Homo sapiens (Human)
Description:
P08246
Residue:
267
  
Inhibitor
Name:
BDBM50005888
Synonyms:
1-Hydroxy-8-methoxy-2-pentyl-anthraquinone | CHEMBL40281
Type:
Small organic molecule
Emp. Form.:
C20H20O4
Mol. Mass.:
324.3704
SMILES:
CCCCCc1ccc2C(=O)c3cccc(OC)c3C(=O)c2c1O
: